Mandriva 2007 compile errors

classic Classic list List threaded Threaded
10 messages Options
Reply | Threaded
Open this post in threaded view
|

Mandriva 2007 compile errors

Rick Kunath
I haven't built the CVS version of svxlink in a while, but upgraded the OS
from Mandriva 2006 to 2007 and am re-installing things.

I did a make realclean, then make and get quite a few of the sigc-configure
errors. I do have libsigc++ versions 1.2 and 2.0 installed along with the
devel packages.

I'd appreciate any ideas as to what the compile problem is.

Thanks in advance for a great app,

Rick Kunath, k9ao

-------------------------------------------------
--- Generating DtmfPlot.cpp from DtmfPlot.ui...
make[3]: sigc-config: Command not found
--- Creating dependency file depend/DtmfPlot.dpp...
--- Generating DtmfPlot.h from DtmfPlot.ui...
--- Running the Meta Object Compiler on DtmfPlot.h...
make[3]: sigc-config: Command not found
--- Creating dependency file depend/moc_DtmfPlot.dpp...
make[3]: sigc-config: Command not found
--- Creating dependency file depend/dtmf_plot.dpp...
make[3]: sigc-config: Command not found
--- Creating dependency file depend/DtmfDecoder.dpp...
make[3]: sigc-config: Command not found
--- Creating dependency file depend/ToneDetector.dpp...
make[2]: *** [all] Error 2
make[1]: *** [all] Error 2
make: *** [all] Error 2

-------------------------------------------------------------------------
Using Tomcat but need to do more? Need to support web services, security?
Get stuff done quickly with pre-integrated technology to make your job easier
Download IBM WebSphere Application Server v.1.0.1 based on Apache Geronimo
http://sel.as-us.falkag.net/sel?cmd=lnk&kid=120709&bid=263057&dat=121642
_______________________________________________
Svxlink-devel mailing list
[hidden email]
https://lists.sourceforge.net/lists/listinfo/svxlink-devel
Reply | Threaded
Open this post in threaded view
|

Re: Mandriva 2007 compile errors

Tobias Blomberg
On Monday 16 October 2006 05:19, Rick Kunath wrote:
> I haven't built the CVS version of svxlink in a while, but upgraded the OS
> from Mandriva 2006 to 2007 and am re-installing things.
>
> I did a make realclean, then make and get quite a few of the sigc-configure
> errors. I do have libsigc++ versions 1.2 and 2.0 installed along with the
> devel packages.

Unfortunately, SvxLink only work with version 1.0.4 at the moment. I'm working
(slowly) on converting it to use 2.0 instead.

Mandriva is RPM-based, isn't it?  Try using the source RPM from atrpms to
compile new packages:

# cd /tmp
# wget http://dl.atrpms.net/all/libsigc++104-1.0.4-0_2.at.src.rpm
# rpmbuild --rebuild libsigc++104-1.0.4-0_2.at.src.rpm
# cd /usr/src/redhat/RPMS/i386
# rpm -Uvh libsigc++104-1.0.4-0_2.i386.rpm
# rpm -Uvh libsigc++104-devel-1.0.4-0_2.i386.rpm

You probably will have to tweak these instructions for Mandriva. They work for
Fedora.


> I'd appreciate any ideas as to what the compile problem is.

Hmmm... You probably would have gotten some help by reading:

http://svxlink.sourceforge.net/install.php
https://sourceforge.net/search/index.php?type_of_search=mlists&group_id=84813&forum_id=34097

73 de SM0SVX / Tobias

>
> Thanks in advance for a great app,
>
> Rick Kunath, k9ao
>
> -------------------------------------------------
> --- Generating DtmfPlot.cpp from DtmfPlot.ui...
> make[3]: sigc-config: Command not found
> --- Creating dependency file depend/DtmfPlot.dpp...
> --- Generating DtmfPlot.h from DtmfPlot.ui...
> --- Running the Meta Object Compiler on DtmfPlot.h...
> make[3]: sigc-config: Command not found
> --- Creating dependency file depend/moc_DtmfPlot.dpp...
> make[3]: sigc-config: Command not found
> --- Creating dependency file depend/dtmf_plot.dpp...
> make[3]: sigc-config: Command not found
> --- Creating dependency file depend/DtmfDecoder.dpp...
> make[3]: sigc-config: Command not found
> --- Creating dependency file depend/ToneDetector.dpp...
> make[2]: *** [all] Error 2
> make[1]: *** [all] Error 2
> make: *** [all] Error 2
>
> -------------------------------------------------------------------------
> Using Tomcat but need to do more? Need to support web services, security?
> Get stuff done quickly with pre-integrated technology to make your job
> easier Download IBM WebSphere Application Server v.1.0.1 based on Apache
> Geronimo
> http://sel.as-us.falkag.net/sel?cmd=lnk&kid=120709&bid=263057&dat=121642
> _______________________________________________
> Svxlink-devel mailing list
> [hidden email]
> https://lists.sourceforge.net/lists/listinfo/svxlink-devel

-------------------------------------------------------------------------
Using Tomcat but need to do more? Need to support web services, security?
Get stuff done quickly with pre-integrated technology to make your job easier
Download IBM WebSphere Application Server v.1.0.1 based on Apache Geronimo
http://sel.as-us.falkag.net/sel?cmd=lnk&kid=120709&bid=263057&dat=121642
_______________________________________________
Svxlink-devel mailing list
[hidden email]
https://lists.sourceforge.net/lists/listinfo/svxlink-devel
Reply | Threaded
Open this post in threaded view
|

Re: Mandriva 2007 compile errors

Rick Kunath
On Monday 16 October 2006 17:04, Tobias Blomberg wrote:

> # cd /tmp
> # wget http://dl.atrpms.net/all/libsigc++104-1.0.4-0_2.at.src.rpm
> # rpmbuild --rebuild libsigc++104-1.0.4-0_2.at.src.rpm
> # cd /usr/src/redhat/RPMS/i386
> # rpm -Uvh libsigc++104-1.0.4-0_2.i386.rpm
> # rpm -Uvh libsigc++104-devel-1.0.4-0_2.i386.rpm
>
> You probably will have to tweak these instructions for Mandriva. They work
> for Fedora.
>

Thanks for the quick reply, and that did the trick. Mandriva had pre-built
versions of libsigc++ on the mirrirs, so I didn't need to rebuild them.

I get farther on compiling now and all of the other libsigc++ errors are now
gone, but I still error out farther on:


-------------- svxlink/dtmf_plot --------------
--- Generating DtmfPlot.cpp from DtmfPlot.ui...
--- Creating dependency file depend/DtmfPlot.dpp...
--- Generating DtmfPlot.h from DtmfPlot.ui...
--- Running the Meta Object Compiler on DtmfPlot.h...
--- Creating dependency file depend/moc_DtmfPlot.dpp...
--- Creating dependency file depend/dtmf_plot.dpp...
--- Creating dependency file depend/DtmfDecoder.dpp...
--- Creating dependency file depend/ToneDetector.dpp...
make[2]: *** [all] Error 2
make[1]: *** [all] Error 2
make: *** [all] Error 2


I did check the mailing list archives but didn't see anything similar on
either dtmf or tonedetector.

Is it possible I am still missing some dependency? The make output I pasted
isn't exactly full of details.

I appreciate the help and the hard work on the app.

Thanks again in advance,

Rick Kunath

-------------------------------------------------------------------------
Using Tomcat but need to do more? Need to support web services, security?
Get stuff done quickly with pre-integrated technology to make your job easier
Download IBM WebSphere Application Server v.1.0.1 based on Apache Geronimo
http://sel.as-us.falkag.net/sel?cmd=lnk&kid=120709&bid=263057&dat=121642
_______________________________________________
Svxlink-devel mailing list
[hidden email]
https://lists.sourceforge.net/lists/listinfo/svxlink-devel
Reply | Threaded
Open this post in threaded view
|

Re: Mandriva 2007 compile errors

Tobias Blomberg
On Tuesday 17 October 2006 00:47, Rick Kunath wrote:
> Thanks for the quick reply, and that did the trick. Mandriva had pre-built
> versions of libsigc++ on the mirrirs, so I didn't need to rebuild them.

Ok, even easier to fix then.


> I get farther on compiling now and all of the other libsigc++ errors are
> now gone, but I still error out farther on:
>
>
> -------------- svxlink/dtmf_plot --------------
> --- Generating DtmfPlot.cpp from DtmfPlot.ui...
> --- Creating dependency file depend/DtmfPlot.dpp...
> --- Generating DtmfPlot.h from DtmfPlot.ui...
> --- Running the Meta Object Compiler on DtmfPlot.h...
> --- Creating dependency file depend/moc_DtmfPlot.dpp...
> --- Creating dependency file depend/dtmf_plot.dpp...
> --- Creating dependency file depend/DtmfDecoder.dpp...
> --- Creating dependency file depend/ToneDetector.dpp...
> make[2]: *** [all] Error 2
> make[1]: *** [all] Error 2
> make: *** [all] Error 2

The dtmf_plot directory is a bit special since it softlink to some files in
other directories. It's a bit ugly but that is how it is at the moment.

The easiest way to fix the problem is to just remove the dtmf_plot directory
and check it out again. The problem really is the symlinks so it is actually
sufficient to remove these. If you have a look at them with "ls -l" they
probably point to non-existing files.

73 de SM0SVX / Tobias

> I did check the mailing list archives but didn't see anything similar on
> either dtmf or tonedetector.
>
> Is it possible I am still missing some dependency? The make output I pasted
> isn't exactly full of details.
>
> I appreciate the help and the hard work on the app.
>
> Thanks again in advance,
>
> Rick Kunath
>
> -------------------------------------------------------------------------
> Using Tomcat but need to do more? Need to support web services, security?
> Get stuff done quickly with pre-integrated technology to make your job
> easier Download IBM WebSphere Application Server v.1.0.1 based on Apache
> Geronimo
> http://sel.as-us.falkag.net/sel?cmd=lnk&kid=120709&bid=263057&dat=121642
> _______________________________________________
> Svxlink-devel mailing list
> [hidden email]
> https://lists.sourceforge.net/lists/listinfo/svxlink-devel

-------------------------------------------------------------------------
Using Tomcat but need to do more? Need to support web services, security?
Get stuff done quickly with pre-integrated technology to make your job easier
Download IBM WebSphere Application Server v.1.0.1 based on Apache Geronimo
http://sel.as-us.falkag.net/sel?cmd=lnk&kid=120709&bid=263057&dat=121642
_______________________________________________
Svxlink-devel mailing list
[hidden email]
https://lists.sourceforge.net/lists/listinfo/svxlink-devel
Reply | Threaded
Open this post in threaded view
|

Re: Mandriva 2007 compile errors

Rick Kunath-2
On Tuesday 17 October 2006 02:29, Tobias Blomberg wrote:
> The dtmf_plot directory is a bit special since it softlink to some files in
> other directories. It's a bit ugly but that is how it is at the moment.
>
> The easiest way to fix the problem is to just remove the dtmf_plot
> directory and check it out again. The problem really is the symlinks so it
> is actually sufficient to remove these. If you have a look at them with "ls
> -l" they probably point to non-existing files.

I did exactly that, a complete new checkout, and got the same results.

All of the files the simlinks in dtmf_plot are there in the tree:

ls -l
total 40
drwxr-xr-x 2 rick rick  128 Oct 17 17:31 CVS/
drwxr-xr-x 2 rick rick  208 Oct 17 17:33 depend/
lrwxrwxrwx 1 rick rick   21 Oct 17 17:33
DtmfDecoder.cpp -> ../rx/DtmfDecoder.cpp
lrwxrwxrwx 1 rick rick   19 Oct 17 17:33 DtmfDecoder.h -> ../rx/DtmfDecoder.h
-rw-r--r-- 1 rick rick 6412 Jul  9 08:49 dtmf_plot.cpp
-rw-r--r-- 1 rick rick 2711 Oct 17 17:33 DtmfPlot.cpp
-rw-r--r-- 1 rick rick 1126 Oct 17 17:33 DtmfPlot.h
-rw-r--r-- 1 rick rick 4562 May 23  2004 DtmfPlot.ui
lrwxrwxrwx 1 rick rick   18 Oct 17 17:33 Makefile -> ../../makefile.sub
-rw-r--r-- 1 rick rick 7246 May 17 14:35 Makefile.default
-rw-r--r-- 1 rick rick   23 Oct 17 17:33 makefile.root
-rw-r--r-- 1 rick rick 2715 Oct 17 17:33 moc_DtmfPlot.cpp
lrwxrwxrwx 1 rick rick   22 Oct 17 17:33
ToneDetector.cpp -> ../rx/ToneDetector.cpp
lrwxrwxrwx 1 rick rick   20 Oct 17 17:33
ToneDetector.h -> ../rx/ToneDetector.h

And I get the same error on make:

-------------- svxlink/dtmf_plot --------------
--- Generating DtmfPlot.cpp from DtmfPlot.ui...
--- Creating dependency file depend/DtmfPlot.dpp...
--- Generating DtmfPlot.h from DtmfPlot.ui...
--- Running the Meta Object Compiler on DtmfPlot.h...
--- Creating dependency file depend/moc_DtmfPlot.dpp...
--- Creating dependency file depend/dtmf_plot.dpp...
--- Creating dependency file depend/DtmfDecoder.dpp...
--- Creating dependency file depend/ToneDetector.dpp...
make[2]: *** [all] Error 2
make[1]: *** [all] Error 2
make: *** [all] Error 2

I pasted in the contents of the ToneDetector.dpp file after a make realclean
and the failure below my signature. I don't know if it will be of any value.

Is there anything I can look at to try to see exactly what the errors are?

Thanks again in advance,
Rick Kunath

----------------------------------------------------------------------------
ToneDetector.o depend/ToneDetector.dpp: ToneDetector.cpp \
  /usr/lib/gcc/i586-mandriva-linux-gnu/4.1.1/../../../../include/c++/4.1.1/cstdio
\
  /usr/lib/gcc/i586-mandriva-linux-gnu/4.1.1/../../../../include/c++/4.1.1/i586-mandriva-linux-gnu/bits/c++config.h
\
  /usr/lib/gcc/i586-mandriva-linux-gnu/4.1.1/../../../../include/c++/4.1.1/i586-mandriva-linux-gnu/bits/os_defines.h
\
  /usr/include/features.h /usr/include/sys/cdefs.h \
  /usr/include/bits/wordsize.h /usr/include/gnu/stubs.h \
  /usr/include/gnu/stubs-32.h \
  /usr/lib/gcc/i586-mandriva-linux-gnu/4.1.1/../../../../include/c++/4.1.1/i586-mandriva-linux-gnu/bits/cpu_defines.h
\
  /usr/lib/gcc/i586-mandriva-linux-gnu/4.1.1/../../../../include/c++/4.1.1/cstddef
\
  /usr/lib/gcc/i586-mandriva-linux-gnu/4.1.1/include/stddef.h \
  /usr/include/stdio.h /usr/include/bits/types.h \
  /usr/include/bits/typesizes.h /usr/include/libio.h \
  /usr/include/_G_config.h /usr/include/wchar.h /usr/include/bits/wchar.h \
  /usr/include/gconv.h \
  /usr/lib/gcc/i586-mandriva-linux-gnu/4.1.1/include/stdarg.h \
  /usr/include/bits/stdio_lim.h /usr/include/bits/sys_errlist.h \
  /usr/lib/gcc/i586-mandriva-linux-gnu/4.1.1/../../../../include/c++/4.1.1/cstdlib
\
  /usr/include/stdlib.h /usr/include/bits/waitflags.h \
  /usr/include/bits/waitstatus.h /usr/include/endian.h \
  /usr/include/bits/endian.h /usr/include/xlocale.h \
  /usr/include/sys/types.h /usr/include/time.h /usr/include/sys/select.h \
  /usr/include/bits/select.h /usr/include/bits/sigset.h \
  /usr/include/bits/time.h /usr/include/sys/sysmacros.h \
  /usr/include/bits/pthreadtypes.h /usr/include/alloca.h \
  /usr/lib/gcc/i586-mandriva-linux-gnu/4.1.1/../../../../include/c++/4.1.1/cmath
\
  /usr/lib/gcc/i586-mandriva-linux-gnu/4.1.1/../../../../include/c++/4.1.1/bits/cpp_type_traits.h
\
  /usr/include/math.h /usr/include/bits/huge_val.h \
  /usr/include/bits/huge_valf.h /usr/include/bits/huge_vall.h \
  /usr/include/bits/inf.h /usr/include/bits/nan.h \
  /usr/include/bits/mathdef.h /usr/include/bits/mathcalls.h \
  /usr/lib/gcc/i586-mandriva-linux-gnu/4.1.1/../../../../include/c++/4.1.1/bits/cmath.tcc
\
  /usr/lib/gcc/i586-mandriva-linux-gnu/4.1.1/../../../../include/c++/4.1.1/cassert
\
  /usr/include/assert.h \
  /usr/lib/gcc/i586-mandriva-linux-gnu/4.1.1/../../../../include/c++/4.1.1/iostream
\
  /usr/lib/gcc/i586-mandriva-linux-gnu/4.1.1/../../../../include/c++/4.1.1/ostream
\
  /usr/lib/gcc/i586-mandriva-linux-gnu/4.1.1/../../../../include/c++/4.1.1/ios
\
  /usr/lib/gcc/i586-mandriva-linux-gnu/4.1.1/../../../../include/c++/4.1.1/iosfwd
\
  /usr/lib/gcc/i586-mandriva-linux-gnu/4.1.1/../../../../include/c++/4.1.1/i586-mandriva-linux-gnu/bits/c++locale.h
\
  /usr/lib/gcc/i586-mandriva-linux-gnu/4.1.1/../../../../include/c++/4.1.1/cstring
\
  /usr/include/string.h \
  /usr/lib/gcc/i586-mandriva-linux-gnu/4.1.1/../../../../include/c++/4.1.1/clocale
\
  /usr/include/locale.h /usr/include/bits/locale.h \
  /usr/include/langinfo.h /usr/include/nl_types.h /usr/include/iconv.h \
  /usr/include/libintl.h \
  /usr/lib/gcc/i586-mandriva-linux-gnu/4.1.1/../../../../include/c++/4.1.1/i586-mandriva-linux-gnu/bits/c++io.h
\
  /usr/lib/gcc/i586-mandriva-linux-gnu/4.1.1/../../../../include/c++/4.1.1/i586-mandriva-linux-gnu/bits/gthr.h
\
  /usr/lib/gcc/i586-mandriva-linux-gnu/4.1.1/../../../../include/c++/4.1.1/i586-mandriva-linux-gnu/bits/gthr-default.h
\
  /usr/include/pthread.h /usr/include/sched.h /usr/include/bits/sched.h \
  /usr/include/signal.h /usr/include/bits/setjmp.h /usr/include/unistd.h \
  /usr/include/bits/posix_opt.h /usr/include/bits/environments.h \
  /usr/include/bits/confname.h /usr/include/getopt.h \
  /usr/lib/gcc/i586-mandriva-linux-gnu/4.1.1/../../../../include/c++/4.1.1/cctype
\
  /usr/include/ctype.h \
  /usr/lib/gcc/i586-mandriva-linux-gnu/4.1.1/../../../../include/c++/4.1.1/bits/stringfwd.h
\
  /usr/lib/gcc/i586-mandriva-linux-gnu/4.1.1/../../../../include/c++/4.1.1/bits/postypes.h
\
  /usr/lib/gcc/i586-mandriva-linux-gnu/4.1.1/../../../../include/c++/4.1.1/cwchar
\
  /usr/lib/gcc/i586-mandriva-linux-gnu/4.1.1/../../../../include/c++/4.1.1/ctime
\
  /usr/include/stdint.h \
  /usr/lib/gcc/i586-mandriva-linux-gnu/4.1.1/../../../../include/c++/4.1.1/bits/functexcept.h
\
  /usr/lib/gcc/i586-mandriva-linux-gnu/4.1.1/../../../../include/c++/4.1.1/exception_defines.h
\
  /usr/lib/gcc/i586-mandriva-linux-gnu/4.1.1/../../../../include/c++/4.1.1/exception
\
  /usr/lib/gcc/i586-mandriva-linux-gnu/4.1.1/../../../../include/c++/4.1.1/bits/char_traits.h
\
  /usr/lib/gcc/i586-mandriva-linux-gnu/4.1.1/../../../../include/c++/4.1.1/bits/stl_algobase.h
\
  /usr/lib/gcc/i586-mandriva-linux-gnu/4.1.1/../../../../include/c++/4.1.1/climits
\
  /usr/lib/gcc/i586-mandriva-linux-gnu/4.1.1/include/limits.h \
  /usr/lib/gcc/i586-mandriva-linux-gnu/4.1.1/include/syslimits.h \
  /usr/include/limits.h /usr/include/bits/posix1_lim.h \
  /usr/include/bits/local_lim.h /usr/include/linux/limits.h \
  /usr/include/bits/posix2_lim.h /usr/include/bits/xopen_lim.h \
  /usr/lib/gcc/i586-mandriva-linux-gnu/4.1.1/../../../../include/c++/4.1.1/bits/stl_pair.h
\
  /usr/lib/gcc/i586-mandriva-linux-gnu/4.1.1/../../../../include/c++/4.1.1/bits/stl_iterator_base_types.h
\
  /usr/lib/gcc/i586-mandriva-linux-gnu/4.1.1/../../../../include/c++/4.1.1/bits/stl_iterator_base_funcs.h
\
  /usr/lib/gcc/i586-mandriva-linux-gnu/4.1.1/../../../../include/c++/4.1.1/bits/concept_check.h
\
  /usr/lib/gcc/i586-mandriva-linux-gnu/4.1.1/../../../../include/c++/4.1.1/bits/stl_iterator.h
\
  /usr/lib/gcc/i586-mandriva-linux-gnu/4.1.1/../../../../include/c++/4.1.1/debug/debug.h
\
  /usr/lib/gcc/i586-mandriva-linux-gnu/4.1.1/../../../../include/c++/4.1.1/bits/localefwd.h
\
  /usr/lib/gcc/i586-mandriva-linux-gnu/4.1.1/../../../../include/c++/4.1.1/bits/ios_base.h
\
  /usr/lib/gcc/i586-mandriva-linux-gnu/4.1.1/../../../../include/c++/4.1.1/bits/atomicity.h
\
  /usr/lib/gcc/i586-mandriva-linux-gnu/4.1.1/../../../../include/c++/4.1.1/i586-mandriva-linux-gnu/bits/atomic_word.h
\
  /usr/lib/gcc/i586-mandriva-linux-gnu/4.1.1/../../../../include/c++/4.1.1/bits/locale_classes.h
\
  /usr/lib/gcc/i586-mandriva-linux-gnu/4.1.1/../../../../include/c++/4.1.1/string
\
  /usr/lib/gcc/i586-mandriva-linux-gnu/4.1.1/../../../../include/c++/4.1.1/memory
\
  /usr/lib/gcc/i586-mandriva-linux-gnu/4.1.1/../../../../include/c++/4.1.1/bits/allocator.h
\
  /usr/lib/gcc/i586-mandriva-linux-gnu/4.1.1/../../../../include/c++/4.1.1/i586-mandriva-linux-gnu/bits/c++allocator.h
\
  /usr/lib/gcc/i586-mandriva-linux-gnu/4.1.1/../../../../include/c++/4.1.1/ext/new_allocator.h
\
  /usr/lib/gcc/i586-mandriva-linux-gnu/4.1.1/../../../../include/c++/4.1.1/new
\
  /usr/lib/gcc/i586-mandriva-linux-gnu/4.1.1/../../../../include/c++/4.1.1/bits/stl_construct.h
\
  /usr/lib/gcc/i586-mandriva-linux-gnu/4.1.1/../../../../include/c++/4.1.1/bits/stl_uninitialized.h
\
  /usr/lib/gcc/i586-mandriva-linux-gnu/4.1.1/../../../../include/c++/4.1.1/bits/stl_raw_storage_iter.h
\
  /usr/lib/gcc/i586-mandriva-linux-gnu/4.1.1/../../../../include/c++/4.1.1/limits
\
  /usr/lib/gcc/i586-mandriva-linux-gnu/4.1.1/../../../../include/c++/4.1.1/bits/stl_function.h
\
  /usr/lib/gcc/i586-mandriva-linux-gnu/4.1.1/../../../../include/c++/4.1.1/bits/basic_string.h
\
  /usr/lib/gcc/i586-mandriva-linux-gnu/4.1.1/../../../../include/c++/4.1.1/algorithm
\
  /usr/lib/gcc/i586-mandriva-linux-gnu/4.1.1/../../../../include/c++/4.1.1/bits/stl_algo.h
\
  /usr/lib/gcc/i586-mandriva-linux-gnu/4.1.1/../../../../include/c++/4.1.1/bits/stl_heap.h
\
  /usr/lib/gcc/i586-mandriva-linux-gnu/4.1.1/../../../../include/c++/4.1.1/bits/stl_tempbuf.h
\
  /usr/lib/gcc/i586-mandriva-linux-gnu/4.1.1/../../../../include/c++/4.1.1/bits/basic_string.tcc
\
  /usr/lib/gcc/i586-mandriva-linux-gnu/4.1.1/../../../../include/c++/4.1.1/streambuf
\
  /usr/lib/gcc/i586-mandriva-linux-gnu/4.1.1/../../../../include/c++/4.1.1/bits/streambuf.tcc
\
  /usr/lib/gcc/i586-mandriva-linux-gnu/4.1.1/../../../../include/c++/4.1.1/bits/basic_ios.h
\
  /usr/lib/gcc/i586-mandriva-linux-gnu/4.1.1/../../../../include/c++/4.1.1/bits/streambuf_iterator.h
\
  /usr/lib/gcc/i586-mandriva-linux-gnu/4.1.1/../../../../include/c++/4.1.1/bits/locale_facets.h
\
  /usr/lib/gcc/i586-mandriva-linux-gnu/4.1.1/../../../../include/c++/4.1.1/cwctype
\
  /usr/include/wctype.h \
  /usr/lib/gcc/i586-mandriva-linux-gnu/4.1.1/../../../../include/c++/4.1.1/i586-mandriva-linux-gnu/bits/ctype_base.h
\
  /usr/lib/gcc/i586-mandriva-linux-gnu/4.1.1/../../../../include/c++/4.1.1/i586-mandriva-linux-gnu/bits/ctype_inline.h
\
  /usr/lib/gcc/i586-mandriva-linux-gnu/4.1.1/../../../../include/c++/4.1.1/bits/codecvt.h
\
  /usr/lib/gcc/i586-mandriva-linux-gnu/4.1.1/../../../../include/c++/4.1.1/i586-mandriva-linux-gnu/bits/time_members.h
\
  /usr/lib/gcc/i586-mandriva-linux-gnu/4.1.1/../../../../include/c++/4.1.1/i586-mandriva-linux-gnu/bits/messages_members.h
\
  /usr/lib/gcc/i586-mandriva-linux-gnu/4.1.1/../../../../include/c++/4.1.1/bits/basic_ios.tcc
\
  /usr/lib/gcc/i586-mandriva-linux-gnu/4.1.1/../../../../include/c++/4.1.1/bits/ostream.tcc
\
  /usr/lib/gcc/i586-mandriva-linux-gnu/4.1.1/../../../../include/c++/4.1.1/locale
\
  /usr/lib/gcc/i586-mandriva-linux-gnu/4.1.1/../../../../include/c++/4.1.1/bits/locale_facets.tcc
\
  /usr/lib/gcc/i586-mandriva-linux-gnu/4.1.1/../../../../include/c++/4.1.1/typeinfo
\
  /usr/lib/gcc/i586-mandriva-linux-gnu/4.1.1/../../../../include/c++/4.1.1/istream
\
  /usr/lib/gcc/i586-mandriva-linux-gnu/4.1.1/../../../../include/c++/4.1.1/bits/istream.tcc
\
  ../../include/AudioFilter.h ../../include/AudioProcessor.h \
  ../../include/AudioSource.h ../../include/AudioSink.h \
  ../../include/SigCAudioSink.h \
  /usr/include/sigc++-1.0/sigc++/signal_system.h \
  /usr/include/sigc++-1.0/sigc++/slot.h /usr/include/sigc++config.h \
  /usr/include/sigc++-1.0/sigc++/type.h \
  /usr/include/sigc++-1.0/sigc++/object.h \
  /usr/include/sigc++-1.0/sigc++/scope.h \
  /usr/include/sigc++-1.0/sigc++/handle.h \
  /usr/include/sigc++-1.0/sigc++/object_slot.h \
  /usr/include/sigc++-1.0/sigc++/func_slot.h \
  /usr/include/sigc++-1.0/sigc++/basic_signal.h \
  /usr/include/sigc++-1.0/sigc++/marshal.h \
  /usr/include/sigc++-1.0/sigc++/thread.h ToneDetector.h

-------------------------------------------------------------------------
Using Tomcat but need to do more? Need to support web services, security?
Get stuff done quickly with pre-integrated technology to make your job easier
Download IBM WebSphere Application Server v.1.0.1 based on Apache Geronimo
http://sel.as-us.falkag.net/sel?cmd=lnk&kid=120709&bid=263057&dat=121642
_______________________________________________
Svxlink-devel mailing list
[hidden email]
https://lists.sourceforge.net/lists/listinfo/svxlink-devel
Reply | Threaded
Open this post in threaded view
|

Re: Mandriva 2007 compile errors

Rick Kunath-2
In reply to this post by Tobias Blomberg
I pasted the output of make -d below, from a Mandrake 10.1 machine, if that
helps at all.

I tried to build svxlink on a Mandrake 10.1 machine and 2 Mandriva 2006
machines, along with the Mandriva 2007 machine I originally posted about. The
10.1 and 2006 machines have successfully built svxlink in the past, but no
longer can complete make on CVS without the same error I posted about in the
last message.

The output is below.

Thanks in advance,
Rick Kunath

-----------------------------
Pruning file `/usr/lib/qt3//include/qgroupbox.h'.
   Pruning file `/usr/lib/qt3//include/qframe.h'.
   Pruning file `/usr/lib/qt3//include/qprogressbar.h'.
   Pruning file `/usr/lib/qt3//include/qlineedit.h'.
   Considering target file `AsyncQtApplication.h'.
    File `AsyncQtApplication.h' does not exist.
    Looking for an implicit rule for `AsyncQtApplication.h'.
    Trying pattern rule with stem `AsyncQtApplication'.
    Trying implicit prerequisite `AsyncQtApplication.ui'.
    Trying pattern rule with stem `AsyncQtApplication.h'.
    Trying implicit prerequisite `AsyncQtApplication.h,v'.
    Trying pattern rule with stem `AsyncQtApplication.h'.
    Trying implicit prerequisite `RCS/AsyncQtApplication.h,v'.
    Trying pattern rule with stem `AsyncQtApplication.h'.
    Trying implicit prerequisite `RCS/AsyncQtApplication.h'.
    Trying pattern rule with stem `AsyncQtApplication.h'.
    Trying implicit prerequisite `s.AsyncQtApplication.h'.
    Trying pattern rule with stem `AsyncQtApplication.h'.
    Trying implicit prerequisite `SCCS/s.AsyncQtApplication.h'.
    Trying pattern rule with stem `AsyncQtApplication'.
    Trying implicit prerequisite `AsyncQtApplication.ui'.
    Looking for a rule with intermediate file `AsyncQtApplication.ui'.
     Avoiding implicit rule recursion.
     Trying pattern rule with stem `AsyncQtApplication.ui'.
     Trying implicit prerequisite `AsyncQtApplication.ui,v'.
     Trying pattern rule with stem `AsyncQtApplication.ui'.
     Trying implicit prerequisite `RCS/AsyncQtApplication.ui,v'.
     Trying pattern rule with stem `AsyncQtApplication.ui'.
     Trying implicit prerequisite `RCS/AsyncQtApplication.ui'.
     Trying pattern rule with stem `AsyncQtApplication.ui'.
     Trying implicit prerequisite `s.AsyncQtApplication.ui'.
     Trying pattern rule with stem `AsyncQtApplication.ui'.
     Trying implicit prerequisite `SCCS/s.AsyncQtApplication.ui'.
    No implicit rule found for `AsyncQtApplication.h'.
    Finished prerequisites of target file `AsyncQtApplication.h'.
   Must remake target `AsyncQtApplication.h'.
make[3]: *** No rule to make target `AsyncQtApplication.h', needed by
`depend/dtmf_plot.dpp'.  Stop.
Got a SIGCHLD; 1 unreaped children.
Reaping losing child 0x08077d40 PID 27535
make[2]: *** [all] Error 2
Removing child 0x08077d40 PID 27535 from chain.
Got a SIGCHLD; 1 unreaped children.
Reaping losing child 0x0807ca90 PID 26413
make[1]: *** [all] Error 2
Removing child 0x0807ca90 PID 26413 from chain.
Got a SIGCHLD; 1 unreaped children.
Reaping losing child 0x0807bea0 PID 24395
make: *** [all] Error 2
Removing child 0x0807bea0 PID 24395 from chain.

-------------------------------------------------------------------------
Using Tomcat but need to do more? Need to support web services, security?
Get stuff done quickly with pre-integrated technology to make your job easier
Download IBM WebSphere Application Server v.1.0.1 based on Apache Geronimo
http://sel.as-us.falkag.net/sel?cmd=lnk&kid=120709&bid=263057&dat=121642
_______________________________________________
Svxlink-devel mailing list
[hidden email]
https://lists.sourceforge.net/lists/listinfo/svxlink-devel
Reply | Threaded
Open this post in threaded view
|

Re: Mandriva 2007 compile errors

Rick Kunath
In reply to this post by Tobias Blomberg
I pasted the output of make -d below, from a Mandrake 10.1 machine, if that
helps at all.

I tried to build svxlink on a Mandrake 10.1 machine and 2 Mandriva 2006
machines, along with the Mandriva 2007 machine I originally posted about. The
10.1 and 2006 machines have successfully built svxlink in the past, but no
longer can complete make on CVS without the same error I posted about in the
last message.

The output is below.

Thanks in advance,
Rick Kunath

-----------------------------
Pruning file `/usr/lib/qt3//include/qgroupbox.h'.
   Pruning file `/usr/lib/qt3//include/qframe.h'.
   Pruning file `/usr/lib/qt3//include/qprogressbar.h'.
   Pruning file `/usr/lib/qt3//include/qlineedit.h'.
   Considering target file `AsyncQtApplication.h'.
    File `AsyncQtApplication.h' does not exist.
    Looking for an implicit rule for `AsyncQtApplication.h'.
    Trying pattern rule with stem `AsyncQtApplication'.
    Trying implicit prerequisite `AsyncQtApplication.ui'.
    Trying pattern rule with stem `AsyncQtApplication.h'.
    Trying implicit prerequisite `AsyncQtApplication.h,v'.
    Trying pattern rule with stem `AsyncQtApplication.h'.
    Trying implicit prerequisite `RCS/AsyncQtApplication.h,v'.
    Trying pattern rule with stem `AsyncQtApplication.h'.
    Trying implicit prerequisite `RCS/AsyncQtApplication.h'.
    Trying pattern rule with stem `AsyncQtApplication.h'.
    Trying implicit prerequisite `s.AsyncQtApplication.h'.
    Trying pattern rule with stem `AsyncQtApplication.h'.
    Trying implicit prerequisite `SCCS/s.AsyncQtApplication.h'.
    Trying pattern rule with stem `AsyncQtApplication'.
    Trying implicit prerequisite `AsyncQtApplication.ui'.
    Looking for a rule with intermediate file `AsyncQtApplication.ui'.
     Avoiding implicit rule recursion.
     Trying pattern rule with stem `AsyncQtApplication.ui'.
     Trying implicit prerequisite `AsyncQtApplication.ui,v'.
     Trying pattern rule with stem `AsyncQtApplication.ui'.
     Trying implicit prerequisite `RCS/AsyncQtApplication.ui,v'.
     Trying pattern rule with stem `AsyncQtApplication.ui'.
     Trying implicit prerequisite `RCS/AsyncQtApplication.ui'.
     Trying pattern rule with stem `AsyncQtApplication.ui'.
     Trying implicit prerequisite `s.AsyncQtApplication.ui'.
     Trying pattern rule with stem `AsyncQtApplication.ui'.
     Trying implicit prerequisite `SCCS/s.AsyncQtApplication.ui'.
    No implicit rule found for `AsyncQtApplication.h'.
    Finished prerequisites of target file `AsyncQtApplication.h'.
   Must remake target `AsyncQtApplication.h'.
make[3]: *** No rule to make target `AsyncQtApplication.h', needed by
`depend/dtmf_plot.dpp'.  Stop.
Got a SIGCHLD; 1 unreaped children.
Reaping losing child 0x08077d40 PID 27535
make[2]: *** [all] Error 2
Removing child 0x08077d40 PID 27535 from chain.
Got a SIGCHLD; 1 unreaped children.
Reaping losing child 0x0807ca90 PID 26413
make[1]: *** [all] Error 2
Removing child 0x0807ca90 PID 26413 from chain.
Got a SIGCHLD; 1 unreaped children.
Reaping losing child 0x0807bea0 PID 24395
make: *** [all] Error 2
Removing child 0x0807bea0 PID 24395 from chain.

-------------------------------------------------------------------------
Using Tomcat but need to do more? Need to support web services, security?
Get stuff done quickly with pre-integrated technology to make your job easier
Download IBM WebSphere Application Server v.1.0.1 based on Apache Geronimo
http://sel.as-us.falkag.net/sel?cmd=lnk&kid=120709&bid=263057&dat=121642
_______________________________________________
Svxlink-devel mailing list
[hidden email]
https://lists.sourceforge.net/lists/listinfo/svxlink-devel
Reply | Threaded
Open this post in threaded view
|

Re: Mandriva 2007 compile errors

Tobias Blomberg
In reply to this post by Rick Kunath-2
On Saturday 21 October 2006 01:09, Rick Kunath wrote:
> I pasted the output of make -d below, from a Mandrake 10.1 machine, if that
> helps at all.
>
> I tried to build svxlink on a Mandrake 10.1 machine and 2 Mandriva 2006
> machines, along with the Mandriva 2007 machine I originally posted about.
> The 10.1 and 2006 machines have successfully built svxlink in the past, but
> no longer can complete make on CVS without the same error I posted about in
> the last message.

In this case, I think you have been bitten by the Qt problem. Actually it's
not Qt that is the problem but my make files. Just type make again and it
should complete the build.

The previous error you had is more strange. I cannot figure out what this
could be since the symlinks now seem to point to the correct place. If you
don't need dtmf_plot, just exclude it from compilation by editing the file
svxlink/makefile.dirs, removing dtmf_plot.

73 de SM0SVX / Tobias

>
> The output is below.
>
> Thanks in advance,
> Rick Kunath
>
> -----------------------------
> Pruning file `/usr/lib/qt3//include/qgroupbox.h'.
>    Pruning file `/usr/lib/qt3//include/qframe.h'.
>    Pruning file `/usr/lib/qt3//include/qprogressbar.h'.
>    Pruning file `/usr/lib/qt3//include/qlineedit.h'.
>    Considering target file `AsyncQtApplication.h'.
>     File `AsyncQtApplication.h' does not exist.
>     Looking for an implicit rule for `AsyncQtApplication.h'.
>     Trying pattern rule with stem `AsyncQtApplication'.
>     Trying implicit prerequisite `AsyncQtApplication.ui'.
>     Trying pattern rule with stem `AsyncQtApplication.h'.
>     Trying implicit prerequisite `AsyncQtApplication.h,v'.
>     Trying pattern rule with stem `AsyncQtApplication.h'.
>     Trying implicit prerequisite `RCS/AsyncQtApplication.h,v'.
>     Trying pattern rule with stem `AsyncQtApplication.h'.
>     Trying implicit prerequisite `RCS/AsyncQtApplication.h'.
>     Trying pattern rule with stem `AsyncQtApplication.h'.
>     Trying implicit prerequisite `s.AsyncQtApplication.h'.
>     Trying pattern rule with stem `AsyncQtApplication.h'.
>     Trying implicit prerequisite `SCCS/s.AsyncQtApplication.h'.
>     Trying pattern rule with stem `AsyncQtApplication'.
>     Trying implicit prerequisite `AsyncQtApplication.ui'.
>     Looking for a rule with intermediate file `AsyncQtApplication.ui'.
>      Avoiding implicit rule recursion.
>      Trying pattern rule with stem `AsyncQtApplication.ui'.
>      Trying implicit prerequisite `AsyncQtApplication.ui,v'.
>      Trying pattern rule with stem `AsyncQtApplication.ui'.
>      Trying implicit prerequisite `RCS/AsyncQtApplication.ui,v'.
>      Trying pattern rule with stem `AsyncQtApplication.ui'.
>      Trying implicit prerequisite `RCS/AsyncQtApplication.ui'.
>      Trying pattern rule with stem `AsyncQtApplication.ui'.
>      Trying implicit prerequisite `s.AsyncQtApplication.ui'.
>      Trying pattern rule with stem `AsyncQtApplication.ui'.
>      Trying implicit prerequisite `SCCS/s.AsyncQtApplication.ui'.
>     No implicit rule found for `AsyncQtApplication.h'.
>     Finished prerequisites of target file `AsyncQtApplication.h'.
>    Must remake target `AsyncQtApplication.h'.
> make[3]: *** No rule to make target `AsyncQtApplication.h', needed by
> `depend/dtmf_plot.dpp'.  Stop.
> Got a SIGCHLD; 1 unreaped children.
> Reaping losing child 0x08077d40 PID 27535
> make[2]: *** [all] Error 2
> Removing child 0x08077d40 PID 27535 from chain.
> Got a SIGCHLD; 1 unreaped children.
> Reaping losing child 0x0807ca90 PID 26413
> make[1]: *** [all] Error 2
> Removing child 0x0807ca90 PID 26413 from chain.
> Got a SIGCHLD; 1 unreaped children.
> Reaping losing child 0x0807bea0 PID 24395
> make: *** [all] Error 2
> Removing child 0x0807bea0 PID 24395 from chain.
>
> -------------------------------------------------------------------------
> Using Tomcat but need to do more? Need to support web services, security?
> Get stuff done quickly with pre-integrated technology to make your job
> easier Download IBM WebSphere Application Server v.1.0.1 based on Apache
> Geronimo
> http://sel.as-us.falkag.net/sel?cmd=lnk&kid=120709&bid=263057&dat=121642
> _______________________________________________
> Svxlink-devel mailing list
> [hidden email]
> https://lists.sourceforge.net/lists/listinfo/svxlink-devel

-------------------------------------------------------------------------
Using Tomcat but need to do more? Need to support web services, security?
Get stuff done quickly with pre-integrated technology to make your job easier
Download IBM WebSphere Application Server v.1.0.1 based on Apache Geronimo
http://sel.as-us.falkag.net/sel?cmd=lnk&kid=120709&bid=263057&dat=121642
_______________________________________________
Svxlink-devel mailing list
[hidden email]
https://lists.sourceforge.net/lists/listinfo/svxlink-devel
Reply | Threaded
Open this post in threaded view
|

Re: Mandriva 2007 compile errors

Tobias Blomberg
On Sunday 22 October 2006 17:38, you wrote:
> The second make seemed to complete the build, but with a few of the same
> other errors. I pasted a copy of the make output below. From my looking
> at the symlinks, it does look like everything is there and in the right
> place.

Yes, the symlinks are probably correct now. I think you can get it all
compiled now if you go into "async/demo" and "svxlink/dtmf_plot" and first
type "make realclean" and then "make".


> I'll likely do as you suggest and remove the dtmf-plot directory as I am
> using Qtel here, and finish the install.
>
> If you ever need me to look at anything here or want me to try a few
> things, please me know and I'd be glad to help out any way I can.

Ok, I'll remember that :-)

73 de SM0SVX / Tobias

>
> Thanks again,
>
> Rick Kunath
>
> --------------------------
> -------------- async --------------
> -------------- async/core --------------
> -------------- async/cpp --------------
> -------------- async/audio --------------
> -------------- async/qt --------------
> --- Creating ../../include/AsyncQtApplication.h...
> --- Running the Meta Object Compiler on AsyncQtDnsLookupWorker.h...
> --- Creating dependency file depend/moc_AsyncQtDnsLookupWorker.dpp...
> --- Running the Meta Object Compiler on AsyncQtTimer.h...
> --- Creating dependency file depend/moc_AsyncQtTimer.dpp...
> --- Running the Meta Object Compiler on AsyncQtApplication.h...
> --- Creating dependency file depend/moc_AsyncQtApplication.dpp...
> --- Creating dependency file depend/AsyncQtDnsLookupWorker.dpp...
> --- Creating dependency file depend/AsyncQtApplication.dpp...
> --- Compiling AsyncQtApplication.cpp...
> --- Compiling AsyncQtDnsLookupWorker.cpp...
> --- Compiling moc_AsyncQtApplication.cpp...
> --- Compiling moc_AsyncQtTimer.cpp...
> --- Compiling moc_AsyncQtDnsLookupWorker.cpp...
> --- Creating archive ../../lib/libasyncqt.a...
> --- Creating shared object library ../../lib/libasyncqt-0.14.0rc9.so...
> -------------- async/demo --------------
> make[3]: *** No rule to make target `AsyncQtApplication.h', needed by
> `depend/AsyncQtApplication_demo.dpp'.  Stop.
> make[2]: *** [all] Error 2
> make[1]: *** [all] Error 2
> -------------- echolib --------------
> -------------- svxlink --------------
> -------------- svxlink/rx --------------
> -------------- svxlink/svxlink --------------
> -------------- svxlink/modules --------------
> -------------- svxlink/modules/help --------------
> -------------- svxlink/modules/parrot --------------
> -------------- svxlink/modules/echolink --------------
> -------------- svxlink/modules/tcl --------------
> -------------- svxlink/modules/tcl_voice_mail --------------
> -------------- svxlink/modules/dtmf_repeater --------------
> -------------- svxlink/scripts --------------
> -------------- svxlink/remoterx --------------
> -------------- svxlink/dtmf_plot --------------
> make[3]: *** No rule to make target `AsyncQtApplication.h', needed by
> `depend/dtmf_plot.dpp'.  Stop.
> make[2]: *** [all] Error 2
> make[1]: *** [all] Error 2
> -------------- qtel --------------
> --- Generating SettingsDialog.cpp from SettingsDialog.ui...
> --- Creating dependency file depend/SettingsDialog.dpp...
> --- Generating ComDialogBase.cpp from ComDialogBase.ui...
> --- Creating dependency file depend/ComDialogBase.dpp...
> --- Generating MainWindowBase.cpp from MainWindowBase.ui...
> --- Creating dependency file depend/MainWindowBase.dpp...
> --- Generating SettingsDialog.h from SettingsDialog.ui...
> --- Running the Meta Object Compiler on SettingsDialog.h...
> --- Creating dependency file depend/moc_SettingsDialog.dpp...
> --- Generating ComDialogBase.h from ComDialogBase.ui...
> --- Running the Meta Object Compiler on ComDialogBase.h...
> --- Creating dependency file depend/moc_ComDialogBase.dpp...
> --- Generating MainWindowBase.h from MainWindowBase.ui...
> --- Running the Meta Object Compiler on MainWindowBase.h...
> --- Creating dependency file depend/moc_MainWindowBase.dpp...
> --- Running the Meta Object Compiler on MyMessageBox.h...
> --- Creating dependency file depend/moc_MyMessageBox.dpp...
> --- Running the Meta Object Compiler on ComDialog.h...
> --- Creating dependency file depend/moc_ComDialog.dpp...
> --- Running the Meta Object Compiler on MainWindow.h...
> --- Creating dependency file depend/moc_MainWindow.dpp...
> --- Creating dependency file depend/qtel.dpp...
> --- Creating dependency file depend/MsgHandler.dpp...
> --- Creating dependency file depend/Settings.dpp...
> --- Creating dependency file depend/ComDialog.dpp...
> --- Creating dependency file depend/MainWindow.dpp...
> --- Creating dependency file depend/SettingsDialog.dpp...
> --- Creating dependency file depend/ComDialogBase.dpp...
> --- Creating dependency file depend/MainWindowBase.dpp...
> --- Compiling qtel.cpp...
> --- Compiling MainWindow.cpp...
> --- Compiling ComDialog.cpp...
> --- Compiling Settings.cpp...
> --- Compiling MsgHandler.cpp...
> --- Compiling moc_MainWindow.cpp...
> --- Compiling moc_ComDialog.cpp...
> --- Compiling moc_MyMessageBox.cpp...
> --- Compiling moc_MainWindowBase.cpp...
> --- Compiling moc_ComDialogBase.cpp...
> --- Compiling moc_SettingsDialog.cpp...
> --- Compiling MainWindowBase.cpp...
> --- Compiling ComDialogBase.cpp...
> --- Compiling SettingsDialog.cpp...
> --- Linking ../bin/qtel...
> --- Creating translation file translations/qtel_sv.qm...

-------------------------------------------------------------------------
Using Tomcat but need to do more? Need to support web services, security?
Get stuff done quickly with pre-integrated technology to make your job easier
Download IBM WebSphere Application Server v.1.0.1 based on Apache Geronimo
http://sel.as-us.falkag.net/sel?cmd=lnk&kid=120709&bid=263057&dat=121642
_______________________________________________
Svxlink-devel mailing list
[hidden email]
https://lists.sourceforge.net/lists/listinfo/svxlink-devel
Reply | Threaded
Open this post in threaded view
|

Re: Mandriva 2007 compile errors

Tobias Blomberg
In reply to this post by Rick Kunath-2
On Wednesday 18 October 2006 00:09, Rick Kunath wrote:

> On Tuesday 17 October 2006 02:29, Tobias Blomberg wrote:
> > The dtmf_plot directory is a bit special since it softlink to some files
> > in other directories. It's a bit ugly but that is how it is at the
> > moment.
> >
> > The easiest way to fix the problem is to just remove the dtmf_plot
> > directory and check it out again. The problem really is the symlinks so
> > it is actually sufficient to remove these. If you have a look at them
> > with "ls -l" they probably point to non-existing files.
>
> I did exactly that, a complete new checkout, and got the same results.
>
> All of the files the simlinks in dtmf_plot are there in the tree:
>
> ls -l
> total 40
> drwxr-xr-x 2 rick rick  128 Oct 17 17:31 CVS/
> drwxr-xr-x 2 rick rick  208 Oct 17 17:33 depend/
> lrwxrwxrwx 1 rick rick   21 Oct 17 17:33
> DtmfDecoder.cpp -> ../rx/DtmfDecoder.cpp
> lrwxrwxrwx 1 rick rick   19 Oct 17 17:33 DtmfDecoder.h ->
> ../rx/DtmfDecoder.h -rw-r--r-- 1 rick rick 6412 Jul  9 08:49 dtmf_plot.cpp
> -rw-r--r-- 1 rick rick 2711 Oct 17 17:33 DtmfPlot.cpp
> -rw-r--r-- 1 rick rick 1126 Oct 17 17:33 DtmfPlot.h
> -rw-r--r-- 1 rick rick 4562 May 23  2004 DtmfPlot.ui
> lrwxrwxrwx 1 rick rick   18 Oct 17 17:33 Makefile -> ../../makefile.sub
> -rw-r--r-- 1 rick rick 7246 May 17 14:35 Makefile.default
> -rw-r--r-- 1 rick rick   23 Oct 17 17:33 makefile.root
> -rw-r--r-- 1 rick rick 2715 Oct 17 17:33 moc_DtmfPlot.cpp
> lrwxrwxrwx 1 rick rick   22 Oct 17 17:33
> ToneDetector.cpp -> ../rx/ToneDetector.cpp
> lrwxrwxrwx 1 rick rick   20 Oct 17 17:33
> ToneDetector.h -> ../rx/ToneDetector.h
>
> And I get the same error on make:
>
> -------------- svxlink/dtmf_plot --------------
> --- Generating DtmfPlot.cpp from DtmfPlot.ui...
> --- Creating dependency file depend/DtmfPlot.dpp...
> --- Generating DtmfPlot.h from DtmfPlot.ui...
> --- Running the Meta Object Compiler on DtmfPlot.h...
> --- Creating dependency file depend/moc_DtmfPlot.dpp...
> --- Creating dependency file depend/dtmf_plot.dpp...
> --- Creating dependency file depend/DtmfDecoder.dpp...
> --- Creating dependency file depend/ToneDetector.dpp...
> make[2]: *** [all] Error 2
> make[1]: *** [all] Error 2
> make: *** [all] Error 2

I blame "make" for the cryptic error message at the moment. Something seem to
have changed in the later versions. Find the file "makefile.inc" and then the
line "-include $(DEP_FILES)" in that file. Remove the dash in front
of "include". Hopefully you will get a better error message. Removing the
dash will also produce a warning when a "depend/*" file do not exist. That is
what it's for, suppressing the warning. Unfortunately it seem to suppress all
error messages in later versions of "make".

73 de SM0SVX / Tobias

>
> I pasted in the contents of the ToneDetector.dpp file after a make
> realclean and the failure below my signature. I don't know if it will be of
> any value.
>
> Is there anything I can look at to try to see exactly what the errors are?
>
> Thanks again in advance,
> Rick Kunath
>
> ---------------------------------------------------------------------------
>- ToneDetector.o depend/ToneDetector.dpp: ToneDetector.cpp \
>  
> /usr/lib/gcc/i586-mandriva-linux-gnu/4.1.1/../../../../include/c++/4.1.1/cs
>tdio \
>  
> /usr/lib/gcc/i586-mandriva-linux-gnu/4.1.1/../../../../include/c++/4.1.1/i5
>86-mandriva-linux-gnu/bits/c++config.h \
>  
> /usr/lib/gcc/i586-mandriva-linux-gnu/4.1.1/../../../../include/c++/4.1.1/i5
>86-mandriva-linux-gnu/bits/os_defines.h \
>   /usr/include/features.h /usr/include/sys/cdefs.h \
>   /usr/include/bits/wordsize.h /usr/include/gnu/stubs.h \
>   /usr/include/gnu/stubs-32.h \
>  
> /usr/lib/gcc/i586-mandriva-linux-gnu/4.1.1/../../../../include/c++/4.1.1/i5
>86-mandriva-linux-gnu/bits/cpu_defines.h \
>  
> /usr/lib/gcc/i586-mandriva-linux-gnu/4.1.1/../../../../include/c++/4.1.1/cs
>tddef \
>   /usr/lib/gcc/i586-mandriva-linux-gnu/4.1.1/include/stddef.h \
>   /usr/include/stdio.h /usr/include/bits/types.h \
>   /usr/include/bits/typesizes.h /usr/include/libio.h \
>   /usr/include/_G_config.h /usr/include/wchar.h /usr/include/bits/wchar.h \
>   /usr/include/gconv.h \
>   /usr/lib/gcc/i586-mandriva-linux-gnu/4.1.1/include/stdarg.h \
>   /usr/include/bits/stdio_lim.h /usr/include/bits/sys_errlist.h \
>  
> /usr/lib/gcc/i586-mandriva-linux-gnu/4.1.1/../../../../include/c++/4.1.1/cs
>tdlib \
>   /usr/include/stdlib.h /usr/include/bits/waitflags.h \
>   /usr/include/bits/waitstatus.h /usr/include/endian.h \
>   /usr/include/bits/endian.h /usr/include/xlocale.h \
>   /usr/include/sys/types.h /usr/include/time.h /usr/include/sys/select.h \
>   /usr/include/bits/select.h /usr/include/bits/sigset.h \
>   /usr/include/bits/time.h /usr/include/sys/sysmacros.h \
>   /usr/include/bits/pthreadtypes.h /usr/include/alloca.h \
>  
> /usr/lib/gcc/i586-mandriva-linux-gnu/4.1.1/../../../../include/c++/4.1.1/cm
>ath \
>  
> /usr/lib/gcc/i586-mandriva-linux-gnu/4.1.1/../../../../include/c++/4.1.1/bi
>ts/cpp_type_traits.h \
>   /usr/include/math.h /usr/include/bits/huge_val.h \
>   /usr/include/bits/huge_valf.h /usr/include/bits/huge_vall.h \
>   /usr/include/bits/inf.h /usr/include/bits/nan.h \
>   /usr/include/bits/mathdef.h /usr/include/bits/mathcalls.h \
>  
> /usr/lib/gcc/i586-mandriva-linux-gnu/4.1.1/../../../../include/c++/4.1.1/bi
>ts/cmath.tcc \
>  
> /usr/lib/gcc/i586-mandriva-linux-gnu/4.1.1/../../../../include/c++/4.1.1/ca
>ssert \
>   /usr/include/assert.h \
>  
> /usr/lib/gcc/i586-mandriva-linux-gnu/4.1.1/../../../../include/c++/4.1.1/io
>stream \
>  
> /usr/lib/gcc/i586-mandriva-linux-gnu/4.1.1/../../../../include/c++/4.1.1/os
>tream \
>  
> /usr/lib/gcc/i586-mandriva-linux-gnu/4.1.1/../../../../include/c++/4.1.1/io
>s \
>  
> /usr/lib/gcc/i586-mandriva-linux-gnu/4.1.1/../../../../include/c++/4.1.1/io
>sfwd \
>  
> /usr/lib/gcc/i586-mandriva-linux-gnu/4.1.1/../../../../include/c++/4.1.1/i5
>86-mandriva-linux-gnu/bits/c++locale.h \
>  
> /usr/lib/gcc/i586-mandriva-linux-gnu/4.1.1/../../../../include/c++/4.1.1/cs
>tring \
>   /usr/include/string.h \
>  
> /usr/lib/gcc/i586-mandriva-linux-gnu/4.1.1/../../../../include/c++/4.1.1/cl
>ocale \
>   /usr/include/locale.h /usr/include/bits/locale.h \
>   /usr/include/langinfo.h /usr/include/nl_types.h /usr/include/iconv.h \
>   /usr/include/libintl.h \
>  
> /usr/lib/gcc/i586-mandriva-linux-gnu/4.1.1/../../../../include/c++/4.1.1/i5
>86-mandriva-linux-gnu/bits/c++io.h \
>  
> /usr/lib/gcc/i586-mandriva-linux-gnu/4.1.1/../../../../include/c++/4.1.1/i5
>86-mandriva-linux-gnu/bits/gthr.h \
>  
> /usr/lib/gcc/i586-mandriva-linux-gnu/4.1.1/../../../../include/c++/4.1.1/i5
>86-mandriva-linux-gnu/bits/gthr-default.h \
>   /usr/include/pthread.h /usr/include/sched.h /usr/include/bits/sched.h \
>   /usr/include/signal.h /usr/include/bits/setjmp.h /usr/include/unistd.h \
>   /usr/include/bits/posix_opt.h /usr/include/bits/environments.h \
>   /usr/include/bits/confname.h /usr/include/getopt.h \
>  
> /usr/lib/gcc/i586-mandriva-linux-gnu/4.1.1/../../../../include/c++/4.1.1/cc
>type \
>   /usr/include/ctype.h \
>  
> /usr/lib/gcc/i586-mandriva-linux-gnu/4.1.1/../../../../include/c++/4.1.1/bi
>ts/stringfwd.h \
>  
> /usr/lib/gcc/i586-mandriva-linux-gnu/4.1.1/../../../../include/c++/4.1.1/bi
>ts/postypes.h \
>  
> /usr/lib/gcc/i586-mandriva-linux-gnu/4.1.1/../../../../include/c++/4.1.1/cw
>char \
>  
> /usr/lib/gcc/i586-mandriva-linux-gnu/4.1.1/../../../../include/c++/4.1.1/ct
>ime \
>   /usr/include/stdint.h \
>  
> /usr/lib/gcc/i586-mandriva-linux-gnu/4.1.1/../../../../include/c++/4.1.1/bi
>ts/functexcept.h \
>  
> /usr/lib/gcc/i586-mandriva-linux-gnu/4.1.1/../../../../include/c++/4.1.1/ex
>ception_defines.h \
>  
> /usr/lib/gcc/i586-mandriva-linux-gnu/4.1.1/../../../../include/c++/4.1.1/ex
>ception \
>  
> /usr/lib/gcc/i586-mandriva-linux-gnu/4.1.1/../../../../include/c++/4.1.1/bi
>ts/char_traits.h \
>  
> /usr/lib/gcc/i586-mandriva-linux-gnu/4.1.1/../../../../include/c++/4.1.1/bi
>ts/stl_algobase.h \
>  
> /usr/lib/gcc/i586-mandriva-linux-gnu/4.1.1/../../../../include/c++/4.1.1/cl
>imits \
>   /usr/lib/gcc/i586-mandriva-linux-gnu/4.1.1/include/limits.h \
>   /usr/lib/gcc/i586-mandriva-linux-gnu/4.1.1/include/syslimits.h \
>   /usr/include/limits.h /usr/include/bits/posix1_lim.h \
>   /usr/include/bits/local_lim.h /usr/include/linux/limits.h \
>   /usr/include/bits/posix2_lim.h /usr/include/bits/xopen_lim.h \
>  
> /usr/lib/gcc/i586-mandriva-linux-gnu/4.1.1/../../../../include/c++/4.1.1/bi
>ts/stl_pair.h \
>  
> /usr/lib/gcc/i586-mandriva-linux-gnu/4.1.1/../../../../include/c++/4.1.1/bi
>ts/stl_iterator_base_types.h \
>  
> /usr/lib/gcc/i586-mandriva-linux-gnu/4.1.1/../../../../include/c++/4.1.1/bi
>ts/stl_iterator_base_funcs.h \
>  
> /usr/lib/gcc/i586-mandriva-linux-gnu/4.1.1/../../../../include/c++/4.1.1/bi
>ts/concept_check.h \
>  
> /usr/lib/gcc/i586-mandriva-linux-gnu/4.1.1/../../../../include/c++/4.1.1/bi
>ts/stl_iterator.h \
>  
> /usr/lib/gcc/i586-mandriva-linux-gnu/4.1.1/../../../../include/c++/4.1.1/de
>bug/debug.h \
>  
> /usr/lib/gcc/i586-mandriva-linux-gnu/4.1.1/../../../../include/c++/4.1.1/bi
>ts/localefwd.h \
>  
> /usr/lib/gcc/i586-mandriva-linux-gnu/4.1.1/../../../../include/c++/4.1.1/bi
>ts/ios_base.h \
>  
> /usr/lib/gcc/i586-mandriva-linux-gnu/4.1.1/../../../../include/c++/4.1.1/bi
>ts/atomicity.h \
>  
> /usr/lib/gcc/i586-mandriva-linux-gnu/4.1.1/../../../../include/c++/4.1.1/i5
>86-mandriva-linux-gnu/bits/atomic_word.h \
>  
> /usr/lib/gcc/i586-mandriva-linux-gnu/4.1.1/../../../../include/c++/4.1.1/bi
>ts/locale_classes.h \
>  
> /usr/lib/gcc/i586-mandriva-linux-gnu/4.1.1/../../../../include/c++/4.1.1/st
>ring \
>  
> /usr/lib/gcc/i586-mandriva-linux-gnu/4.1.1/../../../../include/c++/4.1.1/me
>mory \
>  
> /usr/lib/gcc/i586-mandriva-linux-gnu/4.1.1/../../../../include/c++/4.1.1/bi
>ts/allocator.h \
>  
> /usr/lib/gcc/i586-mandriva-linux-gnu/4.1.1/../../../../include/c++/4.1.1/i5
>86-mandriva-linux-gnu/bits/c++allocator.h \
>  
> /usr/lib/gcc/i586-mandriva-linux-gnu/4.1.1/../../../../include/c++/4.1.1/ex
>t/new_allocator.h \
>  
> /usr/lib/gcc/i586-mandriva-linux-gnu/4.1.1/../../../../include/c++/4.1.1/ne
>w \
>  
> /usr/lib/gcc/i586-mandriva-linux-gnu/4.1.1/../../../../include/c++/4.1.1/bi
>ts/stl_construct.h \
>  
> /usr/lib/gcc/i586-mandriva-linux-gnu/4.1.1/../../../../include/c++/4.1.1/bi
>ts/stl_uninitialized.h \
>  
> /usr/lib/gcc/i586-mandriva-linux-gnu/4.1.1/../../../../include/c++/4.1.1/bi
>ts/stl_raw_storage_iter.h \
>  
> /usr/lib/gcc/i586-mandriva-linux-gnu/4.1.1/../../../../include/c++/4.1.1/li
>mits \
>  
> /usr/lib/gcc/i586-mandriva-linux-gnu/4.1.1/../../../../include/c++/4.1.1/bi
>ts/stl_function.h \
>  
> /usr/lib/gcc/i586-mandriva-linux-gnu/4.1.1/../../../../include/c++/4.1.1/bi
>ts/basic_string.h \
>  
> /usr/lib/gcc/i586-mandriva-linux-gnu/4.1.1/../../../../include/c++/4.1.1/al
>gorithm \
>  
> /usr/lib/gcc/i586-mandriva-linux-gnu/4.1.1/../../../../include/c++/4.1.1/bi
>ts/stl_algo.h \
>  
> /usr/lib/gcc/i586-mandriva-linux-gnu/4.1.1/../../../../include/c++/4.1.1/bi
>ts/stl_heap.h \
>  
> /usr/lib/gcc/i586-mandriva-linux-gnu/4.1.1/../../../../include/c++/4.1.1/bi
>ts/stl_tempbuf.h \
>  
> /usr/lib/gcc/i586-mandriva-linux-gnu/4.1.1/../../../../include/c++/4.1.1/bi
>ts/basic_string.tcc \
>  
> /usr/lib/gcc/i586-mandriva-linux-gnu/4.1.1/../../../../include/c++/4.1.1/st
>reambuf \
>  
> /usr/lib/gcc/i586-mandriva-linux-gnu/4.1.1/../../../../include/c++/4.1.1/bi
>ts/streambuf.tcc \
>  
> /usr/lib/gcc/i586-mandriva-linux-gnu/4.1.1/../../../../include/c++/4.1.1/bi
>ts/basic_ios.h \
>  
> /usr/lib/gcc/i586-mandriva-linux-gnu/4.1.1/../../../../include/c++/4.1.1/bi
>ts/streambuf_iterator.h \
>  
> /usr/lib/gcc/i586-mandriva-linux-gnu/4.1.1/../../../../include/c++/4.1.1/bi
>ts/locale_facets.h \
>  
> /usr/lib/gcc/i586-mandriva-linux-gnu/4.1.1/../../../../include/c++/4.1.1/cw
>ctype \
>   /usr/include/wctype.h \
>  
> /usr/lib/gcc/i586-mandriva-linux-gnu/4.1.1/../../../../include/c++/4.1.1/i5
>86-mandriva-linux-gnu/bits/ctype_base.h \
>  
> /usr/lib/gcc/i586-mandriva-linux-gnu/4.1.1/../../../../include/c++/4.1.1/i5
>86-mandriva-linux-gnu/bits/ctype_inline.h \
>  
> /usr/lib/gcc/i586-mandriva-linux-gnu/4.1.1/../../../../include/c++/4.1.1/bi
>ts/codecvt.h \
>  
> /usr/lib/gcc/i586-mandriva-linux-gnu/4.1.1/../../../../include/c++/4.1.1/i5
>86-mandriva-linux-gnu/bits/time_members.h \
>  
> /usr/lib/gcc/i586-mandriva-linux-gnu/4.1.1/../../../../include/c++/4.1.1/i5
>86-mandriva-linux-gnu/bits/messages_members.h \
>  
> /usr/lib/gcc/i586-mandriva-linux-gnu/4.1.1/../../../../include/c++/4.1.1/bi
>ts/basic_ios.tcc \
>  
> /usr/lib/gcc/i586-mandriva-linux-gnu/4.1.1/../../../../include/c++/4.1.1/bi
>ts/ostream.tcc \
>  
> /usr/lib/gcc/i586-mandriva-linux-gnu/4.1.1/../../../../include/c++/4.1.1/lo
>cale \
>  
> /usr/lib/gcc/i586-mandriva-linux-gnu/4.1.1/../../../../include/c++/4.1.1/bi
>ts/locale_facets.tcc \
>  
> /usr/lib/gcc/i586-mandriva-linux-gnu/4.1.1/../../../../include/c++/4.1.1/ty
>peinfo \
>  
> /usr/lib/gcc/i586-mandriva-linux-gnu/4.1.1/../../../../include/c++/4.1.1/is
>tream \
>  
> /usr/lib/gcc/i586-mandriva-linux-gnu/4.1.1/../../../../include/c++/4.1.1/bi
>ts/istream.tcc \
>   ../../include/AudioFilter.h ../../include/AudioProcessor.h \
>   ../../include/AudioSource.h ../../include/AudioSink.h \
>   ../../include/SigCAudioSink.h \
>   /usr/include/sigc++-1.0/sigc++/signal_system.h \
>   /usr/include/sigc++-1.0/sigc++/slot.h /usr/include/sigc++config.h \
>   /usr/include/sigc++-1.0/sigc++/type.h \
>   /usr/include/sigc++-1.0/sigc++/object.h \
>   /usr/include/sigc++-1.0/sigc++/scope.h \
>   /usr/include/sigc++-1.0/sigc++/handle.h \
>   /usr/include/sigc++-1.0/sigc++/object_slot.h \
>   /usr/include/sigc++-1.0/sigc++/func_slot.h \
>   /usr/include/sigc++-1.0/sigc++/basic_signal.h \
>   /usr/include/sigc++-1.0/sigc++/marshal.h \
>   /usr/include/sigc++-1.0/sigc++/thread.h ToneDetector.h
>
> -------------------------------------------------------------------------
> Using Tomcat but need to do more? Need to support web services, security?
> Get stuff done quickly with pre-integrated technology to make your job
> easier Download IBM WebSphere Application Server v.1.0.1 based on Apache
> Geronimo
> http://sel.as-us.falkag.net/sel?cmd=lnk&kid=120709&bid=263057&dat=121642
> _______________________________________________
> Svxlink-devel mailing list
> [hidden email]
> https://lists.sourceforge.net/lists/listinfo/svxlink-devel

-------------------------------------------------------------------------
Using Tomcat but need to do more? Need to support web services, security?
Get stuff done quickly with pre-integrated technology to make your job easier
Download IBM WebSphere Application Server v.1.0.1 based on Apache Geronimo
http://sel.as-us.falkag.net/sel?cmd=lnk&kid=120709&bid=263057&dat=121642
_______________________________________________
Svxlink-devel mailing list
[hidden email]
https://lists.sourceforge.net/lists/listinfo/svxlink-devel